• scfg fails to compile

    From Nelgin@1:103/705 to DigitalMan on Thursday, May 14, 2020 11:34:21
    Linking gcc.linux.x64.exe.debug/scfg
    gcc.linux.x64.obj.debug-mt/scfglib1.o: In function `read_node_cfg': /home/bbs/sbbs/src/sbbs3/scfg/../scfglib1.c:96: undefined reference to `arstr' gcc.linux.x64.obj.debug-mt/scfglib1.o: In function `read_main_cfg': /home/bbs/sbbs/src/sbbs3/scfg/../scfglib1.c:242: undefined reference to `arstr' /home/bbs/sbbs/src/sbbs3/scfg/../scfglib1.c:414: undefined reference to `arstr' gcc.linux.x64.obj.debug-mt/scfglib1.o: In function `read_msgs_cfg': /home/bbs/sbbs/src/sbbs3/scfg/../scfglib1.c:454: undefined reference to `arstr' /home/bbs/sbbs/src/sbbs3/scfg/../scfglib1.c:490: undefined reference to `arstr' gcc.linux.x64.obj.debug-mt/scfglib1.o:/home/bbs/sbbs/src/sbbs3/scfg/../scfglib1.c:544: more undefined references to `arstr' follow
    collect2: error: ld returned 1 exit status
    make[1]: *** [gcc.linux.x64.exe.debug/scfg] Error 1
    make[1]: Leaving directory `/home/bbs/sbbs/src/sbbs3/scfg'
    make: *** [scfg] Error 2

    Noted by Dan_C and confirmed here.

    Thanks,
    Nigel

    ---
    Synchronet End Of The Line BBS - endofthelinebbs.com
    * Origin: Vertrauen - [vert/cvs/bbs].synchro.net (1:103/705)